返回首页 热搜

其他用户正在搜索

Could not find module for target 'i386-apple-ios-simulator' Diego Ongaro and John Ousterhout Mosin–Nagant pdf Jessica Treisman (NYU School of Medicine) CEO dismissal: the role of investment analysts Lola Fae’s FIRST Airtight and DP Balls Deep 16+视频 Could not inject STS certificates into adapter servercom.vmware.cis.server.ssoauthentication.exception.ServiceCommunicationException: com.vmware.vim.sso.admin.exception.ConnectionException: java.net.UnknownHostException: vc65hsso1.cimc.com: Temporary failure in name resolution 2020-10-24T02:18:49.593Z [pool-24-thread-1 I ??19????? KOIKAT攻略 Layer 3 filtering 中共19届5中全会 张又侠 2020环西班牙自行车赛 Missing required configuration Module was not compiled with library evolution support; using it means binary compatibility for can't be guaranteed 91罕见精品极品高颜值170长腿嫩模娇妻首次 91罕见高清精品-极品高颜值170长腿嫩模娇妻首次3P轮操 2020-09-24 3d 百度云 Microsoft.Common.targets(3390,5) MSB3030 19届 5中全会 接班人 许其亮 Google OCR engine Localization guided learning for pedestrian attribute recognition 2020-10-22T09:45:43 Failed to build these modules: 2020-10-22T09:45:43 readline Nancy lauren Deja Vu how could you JANTY ENTERPRISES Lutube 1000人斩 Astilleros Onassis 273期 六肖中特 【狗鼠龙鸡蛇马】 Module 'CryptoSwift' was not compiled with library evolution support; using it means binary compatibility for 'OPLoginRegisterKit' can't be guaranteed Con- necting the dots: bringing external corporate gover- nance into the corporate governance puzzle

谷歌搜索引擎入口 谷歌镜像 谷歌访问助手 谷歌翻译在线 Google镜像站 我爱广告任务网